{"text_format":"1","workbook":"xlsx","n_sheets":7,"sheets":["Lengte","Factor","Oppervlakte","Volume","Uitleg 1","Uitleg 2","Uitleg met machten"],"not_rendered":{"charts":0,"images":2,"macros":1,"external_links":0,"defined_names":0,"comments":0,"pivot_tables":0},"unopened":[],"bounds":{"document_bytes":16777216,"sheet_cells":100000,"rows_first":2000,"rows_last":500,"rows_between":2000,"halvings":0,"cell_chars":16384,"cell_head_chars":4096},"cells_cut":0,"cells_raw":0,"read":"whole","date_system":"1900"}

{"sheet":"Lengte","index":0,"n_rows":28,"n_cols":25,"rows_kept":28,"cut":false,"hidden":false,"merged":[]}
[null,null,null,null,null,null,null,null,null,null,null,null,null,"Rand 1-100","Rand 1-6",null,null,"Ran-1-100","rand 1-6 1",null,"random 1-6 2",null,"nr","Eenheid","factor"]
["Oefening metriek stelsel",null,null,null,null,null,null,null,null,null,null,null,null,{"$f":"RANDBETWEEN(0,100)","v":78},{"$f":"RANDBETWEEN(1,7)","v":7},{"$f":"RANDBETWEEN(1,7)","v":1},null,66,3,7,{"$f":"IF(IF(S2=T2,T2+1,T2)=8,1,IF(S2=T2,T2+1,T2))","v":7},null,1,"mm",1E-3]
[null,null,"Gegeven",null,null,"Bereken",null,null,null,null,null,null,null,93,{"$f":"RANDBETWEEN(1,7)","v":2},1,null,79,2,6,6,null,2,"cm",0.01]
[1,null,{"$f":"R2/10*S2*T2*U2","v":970.19999999999982},{"$f":"VLOOKUP(S4,$W$2:$Y$8,2,TRUE)","v":"cm"},"=",null,{"$f":"VLOOKUP(U4,$W$2:$Y$8,2,TRUE)","v":"km"},{"$f":"IF(F4=\"\",\"\",IF(F4=M4,\"Oke\",\"Ojee\"))","v":""},1,null,null,null,{"$f":"C4*VLOOKUP(S4,$W$2:$Y$8,3,TRUE)/VLOOKUP(U4,$W$2:$Y$8,3,TRUE)","v":9.7019999999999988E-3},76,1,5,2.205E-2,65,2,7,7,null,3,"dm",0.1]
[2,null,{"$f":"R3/10*S3*T3*U3","v":568.80000000000007},"km","=",null,{"$f":"VLOOKUP(U5,$W$2:$Y$8,2,TRUE)","v":"hm"},{"$f":"IF(F5=\"\",\"\",IF(F5=M5,\"Oke\",\"Ojee\"))","v":""},2,null,null,null,5688.0000000000009,82,2,7,151.99999999999997,94,7,6,6,null,4,"m ",1]
[3,null,637,"dm","=",null,"m ","",3,null,null,null,63.7,55,5,6,33.119999999999997,81,3,3,4,null,5,"dam",10]
[4,null,2368.7999999999997,"mm","=",null,"dm","",4,null,null,null,23.687999999999995,83,2,3,36000.000000000007,44,1,3,3,null,6,"hm",100]
[5,null,291.59999999999997,"cm","=",null,"dm","",5,null,null,null,29.159999999999997,42,4,3,16920,51,2,2,3,null,7,"km",1000]
[6,null,39.6,"m ","=",null,"cm","",6,null,null,null,3960,42,7,5,1.5E-3,22,4,2,2]
[7,null,61.199999999999996,"dm","=",null,"km","",7,null,null,null,6.1200000000000004E-3,19,1,3,12,65,3,7,7]
[8,null,35.200000000000003,"mm","=",null,"dm","",8,null,null,null,0.35199999999999998,58,7,5,1.7835999999999998E-3,12,1,3,3]
[9,null,955.5,"km","=",null,"dam","",9,null,null,null,95550,30,4,3,1425000,33,7,5,{"$f":"IF(IF(S12=T12,T12+1,T12)=8,1,IF(S12=T12,T12+1,T12))","v":5}]
[10,null,10.799999999999999,"dm","=",null,"km","",10,null,null,null,1.0799999999999998E-3,35,6,4,4.1649999999999999E-4,70,3,7,{"$f":"IF(IF(S13=T13,T13+1,T13)=8,1,IF(S13=T13,T13+1,T13))","v":7}]
[11,null,577.49999999999989,"cm","=",null,"dam","",11,null,null,null,0.5774999999999999,39,2,3,0.1026,90,2,5,5]
[12,null,1029,"cm","=",null,"hm","",12,null,null,null,0.10290000000000001,90,1,5,5.8800000000000008,33,2,6,6]
[13,null,450,"km","=",null,"m ","",13,null,null,null,450000,30,6,7,3360,59,7,4,4]
[14,null,237.59999999999997,"mm","=",null,"m ","",14,null,null,null,0.23759999999999998,18,4,7,24,47,1,4,4]
[15,null,660.80000000000007,"m ","=",null,"dam","",15,null,null,null,66.080000000000013,35,5,7,63.359999999999992,71,4,5,5]
[16,null,75.2,"m ","=",null,"mm","",16,null,null,null,75200,7,1,6,5.52,5,4,1,1]
[17,null,710,"cm","=",null,"mm","",17,null,null,null,7100,37,4,6,0.08,80,2,1,1]
[18,null,2,"km","=",null,"cm","",18,null,null,null,200000,18,7,2,8.3000000000000007,95,7,2,2]
[19,null,16,"mm","=",null,"cm","",19,null,null,null,1.6,80,2,5,55,48,1,1,2]
[20,null,266,"dm","=",null,"km","",20,null,null,null,2.6600000000000002E-2,52,4,5,237650,22,3,7,7]
[21,null,9.6,"hm","=",null,"cm","",21,null,null,null,96000,88,7,5,5.8800000000000008,75,6,2,2]
[22,null,323.40000000000003,"dam","=",null,"dm","",22,null,null,null,32340.000000000004,76,7,4,2.25,6,5,3,3]
[23,null,180,"dam","=",null,"mm","",23,null,null,null,1800000,78,1,6,1.1759999999999999,50,5,1,1]
[24,null,27,"m ","=",null,"dm","",24,null,null,null,270,10,4,2,1.0079999999999998E-3,59,4,3,3]
[25,null,25,"m ","=",null,"hm","",25,null,null,null,{"$f":"C28*VLOOKUP(S28,$W$2:$Y$8,3,TRUE)/VLOOKUP(U28,$W$2:$Y$8,3,TRUE)","v":0.25},9,6,2,863.99999999999989,13,4,6,6]

{"sheet":"Factor","index":1,"n_rows":28,"n_cols":26,"rows_kept":28,"cut":false,"hidden":false,"merged":[]}
[null,null,null,null,null,null,null,null,null,null,null,null,null,"Rand 1-100","Rand 1-6",null,null,"Ran-1-100","rand 1-6 1",null,"random 1-6 2",null,"nr","Factor","factor2","Eenheid2"]
["Oefening metriek stelsel",null,null,null,null,null,null,null,null,null,null,null,null,{"$f":"RANDBETWEEN(0,100)","v":14},{"$f":"RANDBETWEEN(1,7)","v":4},{"$f":"RANDBETWEEN(1,7)","v":5},null,67,3,5,{"$f":"IF(IF(S2=T2,T2+1,T2)=8,1,IF(S2=T2,T2+1,T2))","v":5},null,1,"n",{"$f":"10^-9","v":1.0000000000000001E-9},"V"]
[null,null,"Gegeven",null,null,"Bereken",null,null,null,null,null,null,null,56,{"$f":"RANDBETWEEN(1,7)","v":1},5,null,88,6,2,{"$f":"IF(IF(S3=T3,T3+1,T3)=8,1,IF(S3=T3,T3+1,T3))","v":2},null,2,"μ",{"$f":"10^-6","v":9.9999999999999995E-7},"A"]
[1,null,{"$f":"R2/10*S2*T2*U2","v":502.5},{"$f":"CONCATENATE(VLOOKUP(S4,$W$2:$Z$8,2,TRUE),VLOOKUP(U4,$W$2:$Z$8,4,TRUE))","v":"μV"},"=",null,{"$f":"CONCATENATE(VLOOKUP(U4,$W$2:$Z$8,2,TRUE),VLOOKUP(U4,$W$2:$Z$8,4,TRUE))","v":"nV"},{"$f":"IF(F4=\"\",\"\",IF(F4=M4,\"Oke\",\"Ojee\"))","v":""},1,null,null,null,{"$f":"C4*VLOOKUP(S4,$W$2:$Y$8,3,TRUE)/VLOOKUP(U4,$W$2:$Y$8,3,TRUE)","v":502500},24,3,7,7.9199999999999984E+19,71,2,1,1,null,3,"m",{"$f":"10^-3","v":1E-3},"W"]
[2,null,{"$f":"R3/10*S3*T3*U3","v":211.20000000000002},{"$f":"CONCATENATE(VLOOKUP(S5,$W$2:$Z$8,2,TRUE),VLOOKUP(U5,$W$2:$Z$8,4,TRUE))","v":"μW"},"=",null,{"$f":"CONCATENATE(VLOOKUP(U5,$W$2:$Z$8,2,TRUE),VLOOKUP(U5,$W$2:$Z$8,4,TRUE))","v":"mW"},{"$f":"IF(F5=\"\",\"\",IF(F5=M5,\"Oke\",\"Ojee\"))","v":""},2,null,null,null,{"$f":"C5*VLOOKUP(S5,$W$2:$Y$8,3,TRUE)/VLOOKUP(U5,$W$2:$Y$8,3,TRUE)","v":0.2112},59,2,7,148800,1,2,2,3,null,4," ",{"$f":"10^0","v":1},"g"]
[3,null,14.2,"μN","=",null,"GN","",3,null,null,null,1.4199999999999997E-14,77,2,1,1.8130000000000002E-4,71,2,7,7,null,5,"k",{"$f":"10^3","v":1000},"J"]
[4,null,1.2000000000000002,"GCal","=",null,"MCal","",4,null,null,null,1200.0000000000002,96,6,1,1.17E-6,93,7,6,6,null,6,"M",{"$f":"10^6","v":1000000},"Cal"]
[5,null,695.8,"kW","=",null,"mW","",5,null,null,null,695800000,44,6,7,0.46500000000000002,35,5,3,3,null,7,"G",{"$f":"10^9","v":1000000000},"N"]
[6,null,2343.6000000000004,"mg","=",null," g","",6,null,null,null,2.3436000000000003,22,5,3,1.404E-10,86,3,3,4]
[7,null,157.5,"μCal","=",null,"MCal","",7,null,null,null,1.5749999999999997E-10,15,4,1,24000,36,2,6,6]
[8,null,309.59999999999997,"MN","=",null,"GN","",8,null,null,null,0.30959999999999993,61,1,7,1058400.0000000002,37,6,7,7]
[9,null,259.20000000000005," N","=",null,"GN","",9,null,null,null,2.5920000000000004E-7,10,1,7,1.3999999999999999E-6,82,4,7,7]
[10,null,1087.8000000000002,"GJ","=",null,"kJ","",10,null,null,null,1087800000.0000002,11,7,7,9.8999999999999984E-7,34,7,5,5]
[11,null,1607.1999999999998,"GJ","=",null,"kJ","",11,null,null,null,1607199999.9999998,0,6,4,6.1499999999999984E-10,20,7,5,5]
[12,null,595,"nW","=",null,"mW","",12,null,null,null,5.9500000000000004E-4,44,1,2,0.47,91,1,3,3]
[13,null,350,"mCal","=",null,"MCal","",13,null,null,null,3.5000000000000004E-7,31,6,6,1.0289999999999999,54,3,6,6]
[14,null,81.899999999999991,"mJ","=",null,"kJ","",14,null,null,null,8.1899999999999985E-5,8,4,4,60000000000000,96,3,5,5]
[15,null,583.20000000000005,"ng","=",null," g","",15,null,null,null,5.8320000000000009E-7,75,6,7,0.1104,78,1,4,4]
[16,null,720,"mN","=",null,"GN","",16,null,null,null,7.2E-10,29,1,7,6300000.0000000009,9,3,7,7]
[17,null,124.8,"mV","=",null,"nV","",17,null,null,null,124799999.99999999,87,1,3,2.72E-7,25,3,1,1]
[18,null,132.30000000000001,"μV","=",null,"nV","",18,null,null,null,132300,20,4,5,198000,36,2,1,1]
[19,null,7.5,"μCal","=",null,"MCal","",19,null,null,null,7.5E-12,0,4,5,485999.99999999994,37,2,6,6]
[20,null,7.2,"nJ","=",null,"kJ","",20,null,null,null,7.2000000000000008E-12,32,2,5,158400.00000000003,70,1,5,5]
[21,null,266.40000000000003," N","=",null,"GN","",21,null,null,null,2.6640000000000006E-7,98,4,3,5.9999999999999997E-13,86,4,7,7]
[22,null,175,"GV","=",null,"nV","",22,null,null,null,1.75E+20,2,7,4,4800000.0000000009,50,7,7,1]
[23,null,1685.6,"GW","=",null,"mW","",23,null,null,null,1685600000000000,4,7,2,3.312E+20,61,7,3,3]
[24,null,245,"mCal","=",null,"MCal","",24,null,null,null,2.4499999999999998E-7,89,7,7,2.9749999999999999E-13,94,3,6,6]
[25,null,384.29999999999995,"mV","=",null,"nV","",25,null,null,null,384299999.99999994,78,2,1,396900000,76,3,1,1]

{"sheet":"Oppervlakte","index":2,"n_rows":28,"n_cols":25,"rows_kept":28,"cut":false,"hidden":false,"merged":[]}
[null,null,null,null,null,null,null,null,null,null,null,null,null,"Rand 1-100","Rand 1-6",null,null,"Ran-1-100","rand 1-6 1",null,"random 1-6 2",null,"nr","Eenheid","factor"]
["Oefening metriek stelsel",null,null,null,null,null,null,null,null,null,null,null,null,{"$f":"RANDBETWEEN(0,100)","v":49},{"$f":"RANDBETWEEN(1,7)","v":3},{"$f":"RANDBETWEEN(1,6)","v":1},null,77,5,2,6,null,1,"mm²",9.9999999999999995E-7]
[null,null,"Gegeven",null,null,"Bereken",null,null,null,null,null,null,null,36,{"$f":"RANDBETWEEN(1,7)","v":3},{"$f":"RANDBETWEEN(1,6)","v":5},null,47,1,5,3,null,2,"cm²",1E-4]
[1,null,{"$f":"R2/10*S2*T2*U2","v":462},{"$f":"VLOOKUP(S4,$W$2:$Y$8,2,TRUE)","v":"km²"},"=",null,{"$f":"VLOOKUP(U4,$W$2:$Y$8,2,TRUE)","v":"dm²"},{"$f":"IF(F4=\"\",\"\",IF(F4=M4,\"Oke\",\"Ojee\"))","v":""},1,null,null,null,{"$f":"C4*VLOOKUP(S4,$W$2:$Y$8,3,TRUE)/VLOOKUP(U4,$W$2:$Y$8,3,TRUE)","v":46200000000},0,7,6,213.6,19,7,2,3,null,3,"dm²",0.01]
[2,null,{"$f":"R3/10*S3*T3*U3","v":70.5},"hm²","=",null,{"$f":"VLOOKUP(U5,$W$2:$Y$8,2,TRUE)","v":"hm²"},{"$f":"IF(F5=\"\",\"\",IF(F5=M5,\"Oke\",\"Ojee\"))","v":""},2,null,null,null,{"$f":"C5*VLOOKUP(S5,$W$2:$Y$8,3,TRUE)/VLOOKUP(U5,$W$2:$Y$8,3,TRUE)","v":70.5},66,2,5,0,38,6,5,6,null,4,"m²",1]
[3,null,79.8,"km²","=",null,"dm²","",3,null,null,null,7980000000,98,5,1,0.12599999999999997,73,7,6,3,null,5,"dam²",100]
[4,null,683.99999999999989,"cm²","=",null,"dm²","",4,null,null,null,6.839999999999999,89,3,6,588000,95,2,4,3,null,6,"hm²",10000]
[5,null,919.80000000000007,"cm²","=",null,"km²","",5,null,null,null,9.1980000000000007E-8,31,4,1,0.372,56,2,2,7,null,7,"km²",1000000]
[6,null,228,"dm²","=",null,"cm²","",6,null,null,null,22800,53,4,4,225000000,53,3,5,2]
[7,null,156.79999999999998,"dam²","=",null,"hm²","",7,null,null,null,1.5679999999999998,2,2,2,8.3999999999999995E-3,60,5,6,6]
[8,null,159,"cm²","=",null,"mm²","",8,null,null,null,15900.000000000002,95,3,1,1020000.0000000001,74,2,5,1]
[9,null,1080,"dm²","=",null,"m²","",9,null,null,null,10.8,20,2,4,10656000.000000002,94,3,3,4]
[10,null,74,"dm²","=",null,"mm²","",10,null,null,null,740000,38,5,4,13050000000,80,3,3,1]
[11,null,338.40000000000003,"km²","=",null,"hm²","",11,null,null,null,33840.000000000007,34,4,2,873.6,73,7,2,6]
[12,null,72,"dam²","=",null,"dam²","",12,null,null,null,72,31,5,4,1.89,94,5,2,5]
[13,null,613.20000000000005,"mm²","=",null,"m²","",13,null,null,null,6.1320000000000005E-4,90,5,3,7.5599999999999994E-4,18,1,3,4]
[14,null,470,"km²","=",null,"dam²","",14,null,null,null,4700000,17,7,2,6800,44,7,5,5]
[15,null,21.6,"hm²","=",null,"hm²","",15,null,null,null,21.6,94,3,4,1.44E-8,4,6,5,6]
[16,null,770.00000000000011,"cm²","=",null,"cm²","",16,null,null,null,770.00000000000011,10,3,5,9119999.9999999981,31,2,5,2]
[17,null,72.000000000000014,"hm²","=",null,"m²","",17,null,null,null,720000.00000000012,55,6,4,1.0079999999999998,59,6,3,4]
[18,null,62,"mm²","=",null,"hm²","",18,null,null,null,6.2000000000000001E-9,1,5,5,1.1999999999999999E-4,14,1,6,6]
[19,null,424.80000000000007,"cm²","=",null,"cm²","",19,null,null,null,424.80000000000007,37,2,2,10680,61,2,4,2]
[20,null,50.399999999999991,"km²","=",null,"dam²","",20,null,null,null,503999.99999999994,71,4,2,1.5120000000000001E-2,43,7,6,5]
[21,null,97.6,"cm²","=",null,"mm²","",21,null,null,null,9760,89,3,5,972000.00000000023,84,2,6,1]
[22,null,903,"dm²","=",null,"dam²","",22,null,null,null,9.0299999999999991E-2,2,1,1,3.1949999999999992E-2,53,3,2,5]
[23,null,100.80000000000001,"km²","=",null,"m²","",23,null,null,null,100800000.00000001,25,1,1,1.53,58,7,3,4]
[24,null,159,"cm²","=",null,"cm²","",24,null,null,null,159,28,3,3,0.81000000000000016,19,2,1,2]
[25,null,487.20000000000005,"m²","=",null,"dam²","",25,null,null,null,4.8720000000000008,30,3,4,2.1839999999999998E-2,47,4,5,5]

{"sheet":"Volume","index":3,"n_rows":28,"n_cols":25,"rows_kept":28,"cut":false,"hidden":false,"merged":[]}
[null,null,null,null,null,null,null,null,null,null,null,null,null,"Rand 1-100","Rand 1-6",null,null,"Ran-1-100","rand 1-6 1",null,"random 1-6 2",null,"nr","Eenheid","factor"]
["Oefening metriek stelsel",null,null,null,null,null,null,null,null,null,null,null,null,{"$f":"RANDBETWEEN(0,100)","v":63},{"$f":"RANDBETWEEN(1,7)","v":3},{"$f":"RANDBETWEEN(1,6)","v":1},null,98,1,5,4,null,1,"mm³",1.0000000000000001E-9]
[null,null,"Gegeven",null,null,"Bereken",null,null,null,null,null,null,null,83,{"$f":"RANDBETWEEN(1,7)","v":6},{"$f":"RANDBETWEEN(1,6)","v":5},null,99,2,5,5,null,2,"cm³",9.9999999999999995E-7]
[1,null,{"$f":"R2/10*S2*T2*U2","v":196},{"$f":"VLOOKUP(S4,$W$2:$Y$8,2,TRUE)","v":"mm³"},"=",null,{"$f":"VLOOKUP(U4,$W$2:$Y$8,2,TRUE)","v":"dm³"},{"$f":"IF(F4=\"\",\"\",IF(F4=M4,\"Oke\",\"Ojee\"))","v":""},1,null,null,null,{"$f":"C4*VLOOKUP(S4,$W$2:$Y$8,3,TRUE)/VLOOKUP(U4,$W$2:$Y$8,3,TRUE)","v":1.9599999999999999E-4},18,1,4,98.399999999999991,16,1,2,3,null,3,"dm³",1E-3]
[2,null,{"$f":"R3/10*S3*T3*U3","v":495},"dam³","=",null,{"$f":"VLOOKUP(U5,$W$2:$Y$8,2,TRUE)","v":"m³ "},{"$f":"IF(F5=\"\",\"\",IF(F5=M5,\"Oke\",\"Ojee\"))","v":""},2,null,null,null,{"$f":"C5*VLOOKUP(S5,$W$2:$Y$8,3,TRUE)/VLOOKUP(U5,$W$2:$Y$8,3,TRUE)","v":495000},5,5,4,312000,0,5,1,4,null,4,"m³ ",1]
[3,null,9.6000000000000014,"mm³","=",null,"dm³","",3,null,null,null,9.6000000000000013E-6,93,2,5,99000000000,49,1,1,3,null,5,"dam³",1000]
[4,null,0,"cm³","=",null,"mm³","",4,null,null,null,0,19,4,6,150000000000,5,2,2,1,null,6,"hm³",1000000]
[5,null,14.700000000000001,"mm³","=",null,"dm³","",5,null,null,null,1.4700000000000002E-5,22,2,5,783000,70,1,1,3,null,7,"km³",1000000000]
[6,null,2,"dam³","=",null,"dam³","",6,null,null,null,2,36,1,2,1.6800000000000002E-2,73,5,1,5]
[7,null,21,"hm³","=",null,"dam³","",7,null,null,null,21000,43,5,1,244799999.99999997,60,6,4,5]
[8,null,182.5,"m³ ","=",null,"mm³","",8,null,null,null,182500000000,45,2,3,1.04E+20,78,4,1,1]
[9,null,720,"m³ ","=",null,"cm³","",9,null,null,null,720000000,36,3,3,266000,79,4,4,2]
[10,null,31.2,"cm³","=",null,"dm³","",10,null,null,null,3.1199999999999999E-2,38,7,5,156799999999999.97,23,2,5,3]
[11,null,252.8,"km³","=",null,"hm³","",11,null,null,null,252800,90,3,3,0.27900000000000003,84,7,3,6]
[12,null,69,"m³ ","=",null,"dam³","",12,null,null,null,6.9000000000000006E-2,63,4,6,2.1000000000000005E-11,31,4,3,5]
[13,null,1058.4000000000001,"mm³","=",null,"dam³","",13,null,null,null,1.0584000000000002E-9,57,4,4,516000,97,1,4,5]
[14,null,186,"m³ ","=",null,"hm³","",14,null,null,null,1.8599999999999999E-4,65,7,6,13,54,4,3,6]
[15,null,194,"hm³","=",null,"dm³","",15,null,null,null,194000000000,6,1,5,863999.99999999988,30,6,3,3]
[16,null,388.80000000000007,"km³","=",null,"cm³","",16,null,null,null,3.8880000000000006E+17,45,3,4,410400000.00000006,6,7,5,2]
[17,null,162,"dam³","=",null,"dm³","",17,null,null,null,162000000,97,4,5,48000000,9,5,4,3]
[18,null,42,"hm³","=",null,"mm³","",18,null,null,null,4.2E+16,77,6,5,38.4,15,6,2,1]
[19,null,54,"dam³","=",null,"mm³","",19,null,null,null,54000000000000,73,1,2,211499999.99999997,56,5,5,1]
[20,null,18,"mm³","=",null,"cm³","",20,null,null,null,1.8000000000000002E-2,63,7,2,49,89,1,6,2]
[21,null,140,"m³ ","=",null,"dm³","",21,null,null,null,140000,76,5,4,115200000000000.02,36,4,2,3]
[22,null,106.80000000000001,"mm³","=",null,"mm³","",22,null,null,null,106.80000000000001,71,2,6,5.2,44,1,5,1]
[23,null,86.4,"dam³","=",null,"mm³","",23,null,null,null,86400000000000,60,1,4,359.09999999999997,23,5,3,1]
[24,null,22,"dam³","=",null,"hm³","",24,null,null,null,2.1999999999999999E-2,2,5,2,4.0000000000000001E-3,14,5,2,6]
[25,null,34.5,"dam³","=",null,"cm³","",25,null,null,null,34500000000,56,7,2,0,46,5,6,2]

{"sheet":"Uitleg 1","index":4,"n_rows":0,"n_cols":0,"rows_kept":0,"cut":false,"hidden":false,"merged":[]}

{"sheet":"Uitleg 2","index":5,"n_rows":1,"n_cols":1,"rows_kept":1,"cut":false,"hidden":false,"merged":[]}
["Uiteg"]

{"sheet":"Uitleg met machten","index":6,"n_rows":24,"n_cols":9,"rows_kept":24,"cut":false,"hidden":false,"merged":[]}
[]
["Metriek"]
[]
["De letters van het metriek stelcel staan voor een factor"]
["Vermenigvuldig het getal maal de factor en je komt op de maat van de standaar eenheid."]
[]
["De wetenschappelijk notatie van de factor zegt iets over hoeveel de komma naar recht of links moet"]
[]
[]
["Kilo","x 1000",null,null,null,"komma drie plaatsen naar rechts"]
[]
["m","x 1/1.000",null,null,null,"komma drie plaatsen naar links"]
[]
["G","x 1.000.000.000",null,null,null,null,"1 Gm","=","1.000.000.000 m"]
["M","x 1.000.000",null,null,null,null,"1 Mm","=","1.000.000 m"]
["k","x  1.000",null,null,null,null,"1 km","=","1000 m"]
["h","x 100"]
["da","x 10",null,null,null,null,"1 dam","=","10 m"]
[]
["d","x 1/10"]
["c","x 1/100"]
["m","x 1/1.000",null,null,null,null,"1 mm","=","0,001 m"]
["μ","x 1/1.000.000",null,null,null,null,"1 μm","=","0,000001 m"]
["n","x 1/1.000.000.000",null,null,null,null,"1 nm","=","0,000000001 m"]